Information card for entry 7045182
Formula | Bi5.33 O16 Sr8 |
Calculated formula | Bi5.33333 O16 Sr8 |
Title of publication | Synthesis and crystal structure of Sr<sub>3</sub>Bi<sub>2</sub>O<sub>6</sub> and structural change in the strontium-bismuth-oxide system. |
Authors of publication | Yang, Yanquan; Li, Jian; Yuan, Youyou; Pan, Fengjuan; Shi, Dier; Lin, Cong; Du, Xin; Sun, Junliang |
Journal of publication | Dalton transactions (Cambridge, England : 2003) |
Year of publication | 2018 |
Journal volume | 47 |
Journal issue | 6 |
Pages of publication | 1888 - 1894 |
a | 25.1146 ± 0.0019 Å |
b | 25.1146 ± 0.0019 Å |
c | 18.3685 ± 0.0016 Å |
α | 90° |
β | 90° |
γ | 120° |
Cell volume | 10033.6 ± 1.4 Å3 |
Cell temperature | 180 ± 1 K |
Ambient diffraction temperature | 180 ± 1 K |
Number of distinct elements | 3 |
Space group number | 148 |
Hermann-Mauguin space group symbol | R -3 :H |
Hall space group symbol | -R 3 |
Residual factor for all reflections | 0.0811 |
Residual factor for significantly intense reflections | 0.052 |
Weighted residual factors for significantly intense reflections | 0.1134 |
Weighted residual factors for all reflections included in the refinement | 0.1262 |
Goodness-of-fit parameter for all reflections included in the refinement | 0.994 |
Diffraction radiation wavelength | 0.71073 Å |
Diffraction radiation type | MoKα |