Information card for entry 7049288
Formula | C42 H38 Cl9 F3 Ga2 N2 O3 P2 S |
Calculated formula | C42 H38 Cl9 F3 Ga2 N2 O3 P2 S |
Title of publication | Stabilization of bis(chlorogermyliumylidene)s within bifunctional PNNP ligand frameworks and their reactivity studies. |
Authors of publication | Sahoo, Padmini; Raut, Ravindra K.; Maurya, Devesh; Kumar, Vikas; Rani, Pooja; Gonnade, Rajesh G.; Majumdar, Moumita |
Journal of publication | Dalton transactions (Cambridge, England : 2003) |
Year of publication | 2019 |
Journal volume | 48 |
Journal issue | 21 |
Pages of publication | 7344 - 7351 |
a | 10.8764 ± 0.0004 Å |
b | 37.6034 ± 0.0012 Å |
c | 12.6639 ± 0.0004 Å |
α | 90° |
β | 104.849 ± 0.002° |
γ | 90° |
Cell volume | 5006.4 ± 0.3 Å3 |
Cell temperature | 100 ± 2 K |
Ambient diffraction temperature | 100 ± 2 K |
Number of distinct elements | 9 |
Space group number | 14 |
Hermann-Mauguin space group symbol | P 1 21/n 1 |
Hall space group symbol | -P 2yn |
Residual factor for all reflections | 0.1182 |
Residual factor for significantly intense reflections | 0.0746 |
Weighted residual factors for significantly intense reflections | 0.1899 |
Weighted residual factors for all reflections included in the refinement | 0.2193 |
Goodness-of-fit parameter for all reflections included in the refinement | 1.04 |
Diffraction radiation wavelength | 1.54178 Å |
Diffraction radiation type | CuKα |