Information card for entry 7049388
Chemical name | bis[(allyl)chloro{?1-P-[N-(diphenylboryl)-2-di-tert-butyl-phosphanylbenzaldimine]}palladium] |
Formula | C61 H77 B2 Cl5 N2 P2 Pd2 |
Calculated formula | C61 H77 B2 Cl5 N2 P2 Pd2 |
Title of publication | Synthesis, structure and palladium coordination of ambiphilic, pyridine- and phosphine-tethered N-boryl imine ligands. |
Authors of publication | Lorenzini, Fabio; Lagueux-Tremblay, Pierre-Louis; Kayser, Laure V.; Anderson, Ethan; Arndtsen, Bruce A. |
Journal of publication | Dalton transactions (Cambridge, England : 2003) |
Year of publication | 2019 |
Journal volume | 48 |
Journal issue | 17 |
Pages of publication | 5766 - 5772 |
a | 12.9999 ± 0.0015 Å |
b | 13.3865 ± 0.0016 Å |
c | 35.007 ± 0.004 Å |
α | 90° |
β | 90° |
γ | 90° |
Cell volume | 6092 ± 1.2 Å3 |
Cell temperature | 100 ± 2 K |
Ambient diffraction temperature | 100 ± 2 K |
Number of distinct elements | 7 |
Space group number | 19 |
Hermann-Mauguin space group symbol | P 21 21 21 |
Hall space group symbol | P 2ac 2ab |
Residual factor for all reflections | 0.0296 |
Residual factor for significantly intense reflections | 0.0261 |
Weighted residual factors for significantly intense reflections | 0.0552 |
Weighted residual factors for all reflections included in the refinement | 0.0565 |
Goodness-of-fit parameter for all reflections included in the refinement | 1.015 |
Diffraction radiation wavelength | 0.71073 Å |
Diffraction radiation type | MoKα |