Information card for entry 7049398
Formula | C57 H55 Cl2 Co N3 |
Calculated formula | C57 H55 Cl2 Co N3 |
Title of publication | Highly linear polyethylenes tailored with 2,6-bis[1-(p-dibenzo-cycloheptylarylimino)ethyl]pyridylcobalt dichlorides. |
Authors of publication | Guo, Liwei; Zada, Muhammad; Zhang, Wenjuan; Vignesh, Arumugam; Zhu, Dongzhi; Ma, Yanping; Liang, Tongling; Sun, Wen-Hua |
Journal of publication | Dalton transactions (Cambridge, England : 2003) |
Year of publication | 2019 |
Journal volume | 48 |
Journal issue | 17 |
Pages of publication | 5604 - 5613 |
a | 21.6315 ± 0.0014 Å |
b | 16.205 ± 0.0008 Å |
c | 16.8625 ± 0.001 Å |
α | 90° |
β | 103.227 ± 0.006° |
γ | 90° |
Cell volume | 5754.1 ± 0.6 Å3 |
Cell temperature | 173.15 K |
Ambient diffraction temperature | 173.15 K |
Number of distinct elements | 5 |
Space group number | 14 |
Hermann-Mauguin space group symbol | P 1 21/c 1 |
Hall space group symbol | -P 2ybc |
Residual factor for all reflections | 0.1963 |
Residual factor for significantly intense reflections | 0.1132 |
Weighted residual factors for significantly intense reflections | 0.3165 |
Weighted residual factors for all reflections included in the refinement | 0.3776 |
Goodness-of-fit parameter for all reflections included in the refinement | 1.036 |
Diffraction radiation wavelength | 0.71073 Å |
Diffraction radiation type | MoKα |