Information card for entry 7049399
Formula | C59 H59 Cl2 Co N3 |
Calculated formula | C59 H59 Cl2 Co N3 |
Title of publication | Highly linear polyethylenes tailored with 2,6-bis[1-(p-dibenzo-cycloheptylarylimino)ethyl]pyridylcobalt dichlorides. |
Authors of publication | Guo, Liwei; Zada, Muhammad; Zhang, Wenjuan; Vignesh, Arumugam; Zhu, Dongzhi; Ma, Yanping; Liang, Tongling; Sun, Wen-Hua |
Journal of publication | Dalton transactions (Cambridge, England : 2003) |
Year of publication | 2019 |
Journal volume | 48 |
Journal issue | 17 |
Pages of publication | 5604 - 5613 |
a | 47.9185 ± 0.0016 Å |
b | 12.5342 ± 0.0004 Å |
c | 17.0021 ± 0.0006 Å |
α | 90° |
β | 90.799 ± 0.003° |
γ | 90° |
Cell volume | 10210.8 ± 0.6 Å3 |
Cell temperature | 173 ± 2 K |
Ambient diffraction temperature | 173.15 K |
Number of distinct elements | 5 |
Space group number | 15 |
Hermann-Mauguin space group symbol | C 1 2/c 1 |
Hall space group symbol | -C 2yc |
Residual factor for all reflections | 0.1293 |
Residual factor for significantly intense reflections | 0.0947 |
Weighted residual factors for significantly intense reflections | 0.2449 |
Weighted residual factors for all reflections included in the refinement | 0.2667 |
Goodness-of-fit parameter for all reflections included in the refinement | 1.09 |
Diffraction radiation wavelength | 0.71073 Å |
Diffraction radiation type | MoKα |