Information card for entry 7049402
Formula | C32 H34 Cl3 O3 P Sn |
Calculated formula | C32 H34 Cl3 O3 P Sn |
Title of publication | Transmetallation of bis(6-diphenylphosphinoxy-acenapth-5-yl)mercury with tin tetrachloride, antimony trichloride and bismuth trichloride. |
Authors of publication | Olaru, Marian; Krupke, Sandra; Lork, Enno; Mebs, Stefan; Beckmann, Jens |
Journal of publication | Dalton transactions (Cambridge, England : 2003) |
Year of publication | 2019 |
Journal volume | 48 |
Journal issue | 17 |
Pages of publication | 5585 - 5594 |
a | 8.8921 ± 0.0003 Å |
b | 10.475 ± 0.0004 Å |
c | 16.9858 ± 0.0007 Å |
α | 85.291 ± 0.001° |
β | 84.161 ± 0.001° |
γ | 72.333 ± 0.001° |
Cell volume | 1497.51 ± 0.1 Å3 |
Cell temperature | 100 K |
Ambient diffraction temperature | 100 K |
Number of distinct elements | 6 |
Space group number | 2 |
Hermann-Mauguin space group symbol | P -1 |
Hall space group symbol | -P 1 |
Residual factor for all reflections | 0.0323 |
Residual factor for significantly intense reflections | 0.0257 |
Weighted residual factors for significantly intense reflections | 0.0523 |
Weighted residual factors for all reflections included in the refinement | 0.0546 |
Goodness-of-fit parameter for all reflections included in the refinement | 1.068 |
Diffraction radiation wavelength | 0.71073 Å |
Diffraction radiation type | MoKα |