Information card for entry 7049567
Formula | C35 H35 Cu F12 N5 P2 |
Calculated formula | C35 H35 Cu F12 N5 P2 |
Title of publication | Aerobic oxygenation catalyzed by first row transition metal complexes coordinated by tetradentate mono-carbon bridged bis-phenanthroline ligands: intra- versus intermolecular carbon-hydrogen bond activation. |
Authors of publication | Shen, Kaiji; Diskin-Posner, Yael; Shimon, Linda J. W.; Leitus, Gregory; Carmieli, Raanan; Neumann, Ronny |
Journal of publication | Dalton transactions (Cambridge, England : 2003) |
Year of publication | 2019 |
Journal volume | 48 |
Journal issue | 19 |
Pages of publication | 6396 - 6407 |
a | 12.4834 ± 0.0008 Å |
b | 28.3893 ± 0.0016 Å |
c | 20.6218 ± 0.0012 Å |
α | 90° |
β | 98.475 ± 0.006° |
γ | 90° |
Cell volume | 7228.5 ± 0.8 Å3 |
Cell temperature | 100 ± 2 K |
Ambient diffraction temperature | 100 ± 2 K |
Number of distinct elements | 6 |
Space group number | 14 |
Hermann-Mauguin space group symbol | P 1 21/c 1 |
Hall space group symbol | -P 2ybc |
Residual factor for all reflections | 0.1124 |
Residual factor for significantly intense reflections | 0.0725 |
Weighted residual factors for significantly intense reflections | 0.158 |
Weighted residual factors for all reflections included in the refinement | 0.1691 |
Goodness-of-fit parameter for all reflections included in the refinement | 1.058 |
Diffraction radiation wavelength | 0.71073 Å |
Diffraction radiation type | MoKα |