Information card for entry 7049568
Formula | C64 H58 F18 N11 O P3 Zn2 |
Calculated formula | C64 H58 F18 N11 O P3 Zn2 |
Title of publication | Aerobic oxygenation catalyzed by first row transition metal complexes coordinated by tetradentate mono-carbon bridged bis-phenanthroline ligands: intra- versus intermolecular carbon-hydrogen bond activation. |
Authors of publication | Shen, Kaiji; Diskin-Posner, Yael; Shimon, Linda J. W.; Leitus, Gregory; Carmieli, Raanan; Neumann, Ronny |
Journal of publication | Dalton transactions (Cambridge, England : 2003) |
Year of publication | 2019 |
Journal volume | 48 |
Journal issue | 19 |
Pages of publication | 6396 - 6407 |
a | 13.266 ± 0.005 Å |
b | 16.158 ± 0.006 Å |
c | 16.489 ± 0.006 Å |
α | 93.441 ± 0.014° |
β | 103.769 ± 0.013° |
γ | 109.242 ± 0.013° |
Cell volume | 3204 ± 2 Å3 |
Cell temperature | 100 ± 2 K |
Ambient diffraction temperature | 100 ± 2 K |
Number of distinct elements | 7 |
Space group number | 2 |
Hermann-Mauguin space group symbol | P -1 |
Hall space group symbol | -P 1 |
Residual factor for all reflections | 0.0679 |
Residual factor for significantly intense reflections | 0.0488 |
Weighted residual factors for significantly intense reflections | 0.1248 |
Weighted residual factors for all reflections included in the refinement | 0.1381 |
Goodness-of-fit parameter for all reflections included in the refinement | 1.027 |
Diffraction radiation wavelength | 0.71073 Å |
Diffraction radiation type | MoKα |