Information card for entry 7049629
Common name | (S)-1-3MeCN-153K |
Chemical name | (S)-1-3MeCN-153K |
Formula | C156 H141 Cl6 Fe3 N27 O36 |
Calculated formula | C156 H141 Cl6 Fe3 N27 O36 |
Title of publication | Spin crossover and structural phase transition in homochiral and heterochiral Fe[(pybox)<sub>2</sub>]<sup>2+</sup> complexes. |
Authors of publication | Gao, Wan-Qing; Meng, Yin-Shan; Liu, Chun-Hua; Pan, Yao; Liu, Tao; Zhu, Yuan-Yuan |
Journal of publication | Dalton transactions (Cambridge, England : 2003) |
Year of publication | 2019 |
Journal volume | 48 |
Journal issue | 19 |
Pages of publication | 6323 - 6327 |
a | 19.12 ± 0.004 Å |
b | 21.609 ± 0.004 Å |
c | 21.015 ± 0.004 Å |
α | 90° |
β | 116.91 ± 0.03° |
γ | 90° |
Cell volume | 7742 ± 3 Å3 |
Cell temperature | 153 ± 2 K |
Ambient diffraction temperature | 153.15 K |
Number of distinct elements | 6 |
Space group number | 4 |
Hermann-Mauguin space group symbol | P 1 21 1 |
Hall space group symbol | P 2yb |
Residual factor for all reflections | 0.0724 |
Residual factor for significantly intense reflections | 0.0655 |
Weighted residual factors for significantly intense reflections | 0.1753 |
Weighted residual factors for all reflections included in the refinement | 0.1825 |
Goodness-of-fit parameter for all reflections included in the refinement | 1.053 |
Diffraction radiation wavelength | 0.71073 Å |
Diffraction radiation type | MoKα |