Information card for entry 7049630
Common name | S-2-MeNO2-153K |
Chemical name | S-2-MeNO2-153K |
Formula | C95 H81 B2 Fe N7 O6 |
Calculated formula | C95 H81 B2 Fe N7 O6 |
Title of publication | Spin crossover and structural phase transition in homochiral and heterochiral Fe[(pybox)<sub>2</sub>]<sup>2+</sup> complexes. |
Authors of publication | Gao, Wan-Qing; Meng, Yin-Shan; Liu, Chun-Hua; Pan, Yao; Liu, Tao; Zhu, Yuan-Yuan |
Journal of publication | Dalton transactions (Cambridge, England : 2003) |
Year of publication | 2019 |
Journal volume | 48 |
Journal issue | 19 |
Pages of publication | 6323 - 6327 |
a | 12.727 ± 0.003 Å |
b | 12.812 ± 0.003 Å |
c | 47.027 ± 0.009 Å |
α | 90° |
β | 90° |
γ | 90° |
Cell volume | 7668 ± 3 Å3 |
Cell temperature | 153 ± 0.2 K |
Ambient diffraction temperature | 153 ± 0.2 K |
Number of distinct elements | 6 |
Space group number | 19 |
Hermann-Mauguin space group symbol | P 21 21 21 |
Hall space group symbol | P 2ac 2ab |
Residual factor for all reflections | 0.117 |
Residual factor for significantly intense reflections | 0.0914 |
Weighted residual factors for significantly intense reflections | 0.1426 |
Weighted residual factors for all reflections included in the refinement | 0.1589 |
Goodness-of-fit parameter for all reflections included in the refinement | 1.144 |
Diffraction radiation wavelength | 0.71073 Å |
Diffraction radiation type | MoKα |