Information card for entry 7049943
Formula |
C82 H122 Al2 N6 |
Calculated formula |
C82 H122 Al2 N6 |
Title of publication |
Aluminium (III) dialkyl 2,6-bisimino-4R-dihydropyridinates(-1): Selective Synthesis, Structure and Controlled Dimerization. |
Authors of publication |
Gallardo-Villagrán, Manuel; Vidal, Fernando; Palma, Pilar; Alvarez González, Eleuterio; Chen, Eugene; Campora, Juan; Rodríguez Delgado, Antonio |
Journal of publication |
Dalton Transactions |
Year of publication |
2019 |
a |
10.5741 ± 0.0014 Å |
b |
12.4548 ± 0.0016 Å |
c |
16.27 ± 0.002 Å |
α |
74.182 ± 0.003° |
β |
76.401 ± 0.003° |
γ |
75.5 ± 0.004° |
Cell volume |
1963.6 ± 0.4 Å3 |
Cell temperature |
193 ± 2 K |
Ambient diffraction temperature |
193 ± 2 K |
Number of distinct elements |
4 |
Space group number |
2 |
Hermann-Mauguin space group symbol |
P -1 |
Hall space group symbol |
-P 1 |
Residual factor for all reflections |
0.1224 |
Residual factor for significantly intense reflections |
0.069 |
Weighted residual factors for significantly intense reflections |
0.1571 |
Weighted residual factors for all reflections included in the refinement |
0.1784 |
Goodness-of-fit parameter for all reflections included in the refinement |
1.062 |
Diffraction radiation wavelength |
0.71073 Å |
Diffraction radiation type |
MoKα |
Yes |
Yes |
No |