Information card for entry 7049944
Formula |
C86 H116 Al2 Cl4 N6 |
Calculated formula |
C86 H116 Al2 Cl4 N6 |
Title of publication |
Aluminium (III) dialkyl 2,6-bisimino-4R-dihydropyridinates(-1): Selective Synthesis, Structure and Controlled Dimerization. |
Authors of publication |
Gallardo-Villagrán, Manuel; Vidal, Fernando; Palma, Pilar; Alvarez González, Eleuterio; Chen, Eugene; Campora, Juan; Rodríguez Delgado, Antonio |
Journal of publication |
Dalton Transactions |
Year of publication |
2019 |
a |
13.232 ± 0.0004 Å |
b |
16.7149 ± 0.0005 Å |
c |
19.4032 ± 0.0006 Å |
α |
90° |
β |
102.451 ± 0.001° |
γ |
90° |
Cell volume |
4190.5 ± 0.2 Å3 |
Cell temperature |
193 ± 2 K |
Ambient diffraction temperature |
193 ± 2 K |
Number of distinct elements |
5 |
Space group number |
14 |
Hermann-Mauguin space group symbol |
P 1 21/n 1 |
Hall space group symbol |
-P 2yn |
Residual factor for all reflections |
0.0527 |
Residual factor for significantly intense reflections |
0.0431 |
Weighted residual factors for significantly intense reflections |
0.1147 |
Weighted residual factors for all reflections included in the refinement |
0.1204 |
Goodness-of-fit parameter for all reflections included in the refinement |
1.084 |
Diffraction radiation wavelength |
0.71073 Å |
Diffraction radiation type |
MoKα |
Yes |
Yes |
No |