Information card for entry 7049945
Formula | H48 Ho Mo8 N5 O41 |
Calculated formula | Ho Mo8 O46 |
Title of publication | Holmium, thulium and lutetium-octamolybdate [Mo<sub>8</sub>O<sub>28</sub>]<sup>8-</sup> 1D chains: luminescence investigation of europium doped lutetium-octamolybdate. |
Authors of publication | Kaczmarek, Anna M.; Van Deun, Rik; Van Hecke, Kristof |
Journal of publication | Dalton transactions (Cambridge, England : 2003) |
Year of publication | 2019 |
Journal volume | 48 |
Journal issue | 23 |
Pages of publication | 8186 - 8192 |
a | 10.5227 ± 0.0004 Å |
b | 12.9748 ± 0.0005 Å |
c | 14.3537 ± 0.0004 Å |
α | 76.253 ± 0.003° |
β | 84.98 ± 0.003° |
γ | 84.373 ± 0.003° |
Cell volume | 1890.22 ± 0.12 Å3 |
Cell temperature | 100.1 ± 0.2 K |
Ambient diffraction temperature | 100.1 ± 0.2 K |
Number of distinct elements | 5 |
Space group number | 2 |
Hermann-Mauguin space group symbol | P -1 |
Hall space group symbol | -P 1 |
Residual factor for all reflections | 0.0791 |
Residual factor for significantly intense reflections | 0.0682 |
Weighted residual factors for significantly intense reflections | 0.1807 |
Weighted residual factors for all reflections included in the refinement | 0.1875 |
Goodness-of-fit parameter for all reflections included in the refinement | 1.074 |
Diffraction radiation probe | x-ray |
Diffraction radiation wavelength | 1.54184 Å |
Diffraction radiation type | CuKα |