Information card for entry 7054138
Formula | C37 H29 Br2 Fe Mn N8 O5.5 |
Calculated formula | C37 H24 Br2 Fe Mn N8 O5.5 |
Title of publication | Cyanide-bridged 1D Mn(iii)‒Fe(iii) bimetallic complexes: synthesis, crystal structure and magnetic properties |
Authors of publication | Kou, Hui-Zhong; Ni, Zhong-Hai; Liu, Cai-Ming; Zhang, De-Qing; Cui, Ai-Li |
Journal of publication | New Journal of Chemistry |
Year of publication | 2009 |
Journal volume | 33 |
Journal issue | 11 |
Pages of publication | 2296 |
a | 11.1567 ± 0.0009 Å |
b | 15.4314 ± 0.0013 Å |
c | 20.8618 ± 0.0017 Å |
α | 91.765 ± 0.002° |
β | 92.646 ± 0.002° |
γ | 91.871 ± 0.002° |
Cell volume | 3584 ± 0.5 Å3 |
Cell temperature | 296 ± 2 K |
Ambient diffraction temperature | 296 ± 2 K |
Number of distinct elements | 7 |
Space group number | 2 |
Hermann-Mauguin space group symbol | P -1 |
Hall space group symbol | -P 1 |
Residual factor for all reflections | 0.0869 |
Residual factor for significantly intense reflections | 0.0499 |
Weighted residual factors for significantly intense reflections | 0.1127 |
Weighted residual factors for all reflections included in the refinement | 0.1214 |
Goodness-of-fit parameter for all reflections included in the refinement | 1.059 |
Diffraction radiation wavelength | 0.71073 Å |
Diffraction radiation type | MoKα |