Information card for entry 7054139
Formula | C39 H35 Fe Mn N8 O5.5 |
Calculated formula | C39 H30 Fe Mn N8 O5.5 |
Title of publication | Cyanide-bridged 1D Mn(iii)‒Fe(iii) bimetallic complexes: synthesis, crystal structure and magnetic properties |
Authors of publication | Kou, Hui-Zhong; Ni, Zhong-Hai; Liu, Cai-Ming; Zhang, De-Qing; Cui, Ai-Li |
Journal of publication | New Journal of Chemistry |
Year of publication | 2009 |
Journal volume | 33 |
Journal issue | 11 |
Pages of publication | 2296 |
a | 11.292 ± 0.0013 Å |
b | 15.495 ± 0.0017 Å |
c | 20.801 ± 0.003 Å |
α | 92.693 ± 0.007° |
β | 93.138 ± 0.006° |
γ | 92.065 ± 0.0013° |
Cell volume | 3627.4 ± 0.8 Å3 |
Cell temperature | 173 ± 2 K |
Ambient diffraction temperature | 173 ± 2 K |
Number of distinct elements | 6 |
Space group number | 2 |
Hermann-Mauguin space group symbol | P -1 |
Hall space group symbol | -P 1 |
Residual factor for all reflections | 0.088 |
Residual factor for significantly intense reflections | 0.07 |
Weighted residual factors for significantly intense reflections | 0.1767 |
Weighted residual factors for all reflections included in the refinement | 0.1925 |
Goodness-of-fit parameter for all reflections included in the refinement | 1.02 |
Diffraction radiation wavelength | 0.71073 Å |
Diffraction radiation type | MoKα |