Information card for entry 7054599
Formula | C53 H44 Cl2 P2 Ru |
Calculated formula | C53 H44 Cl2 P2 Ru |
Title of publication | Synthesis and characterization of non-chelating ruthenium‒indenylidene olefin metathesis catalysts derived from substituted 1,1-diphenyl-2-propyn-1-ols |
Authors of publication | Yu, Baoyi; Xie, Yu; Hamad, Fatma B.; Leus, Karen; Lyapkov, Alex A.; Van Hecke, Kristof; Verpoort, Francis |
Journal of publication | New J. Chem. |
Year of publication | 2015 |
Journal volume | 39 |
Journal issue | 3 |
Pages of publication | 1858 |
a | 10.2241 ± 0.0008 Å |
b | 12.7121 ± 0.001 Å |
c | 20.0557 ± 0.0016 Å |
α | 72.94 ± 0.007° |
β | 76.718 ± 0.007° |
γ | 81.407 ± 0.006° |
Cell volume | 2415.8 ± 0.3 Å3 |
Cell temperature | 150 ± 2 K |
Ambient diffraction temperature | 150 ± 2 K |
Number of distinct elements | 5 |
Space group number | 2 |
Hermann-Mauguin space group symbol | P -1 |
Hall space group symbol | -P 1 |
Residual factor for all reflections | 0.0843 |
Residual factor for significantly intense reflections | 0.0619 |
Weighted residual factors for significantly intense reflections | 0.1616 |
Weighted residual factors for all reflections included in the refinement | 0.1767 |
Goodness-of-fit parameter for all reflections included in the refinement | 1.026 |
Diffraction radiation wavelength | 0.71073 Å |
Diffraction radiation type | MoKα |