Information card for entry 7054600
Formula | C17 H16 O |
Calculated formula | C17 H16 O |
SMILES | c1(C(c2ccccc2C)(C#C)O)ccccc1C |
Title of publication | Synthesis and characterization of non-chelating ruthenium‒indenylidene olefin metathesis catalysts derived from substituted 1,1-diphenyl-2-propyn-1-ols |
Authors of publication | Yu, Baoyi; Xie, Yu; Hamad, Fatma B.; Leus, Karen; Lyapkov, Alex A.; Van Hecke, Kristof; Verpoort, Francis |
Journal of publication | New J. Chem. |
Year of publication | 2015 |
Journal volume | 39 |
Journal issue | 3 |
Pages of publication | 1858 |
a | 6.6764 ± 0.0002 Å |
b | 16.5673 ± 0.0006 Å |
c | 11.6107 ± 0.0003 Å |
α | 90° |
β | 92.308 ± 0.003° |
γ | 90° |
Cell volume | 1283.22 ± 0.07 Å3 |
Cell temperature | 100 ± 0.1 K |
Ambient diffraction temperature | 100 ± 0.1 K |
Number of distinct elements | 3 |
Space group number | 14 |
Hermann-Mauguin space group symbol | P 1 21/c 1 |
Hall space group symbol | -P 2ybc |
Residual factor for all reflections | 0.045 |
Residual factor for significantly intense reflections | 0.0383 |
Weighted residual factors for significantly intense reflections | 0.1005 |
Weighted residual factors for all reflections included in the refinement | 0.1072 |
Goodness-of-fit parameter for all reflections included in the refinement | 1.062 |
Diffraction radiation wavelength | 1.5418 Å |
Diffraction radiation type | CuKα |