Information card for entry 7057053
Formula | C21 H24 N6 O7 Pb2 |
Calculated formula | C21 H24 N6 O7 Pb2 |
Title of publication | Extended lead(ii) architectures engineered via tetrel bonding interactions |
Authors of publication | Mahmoudi, Ghodrat; Zangrando, Ennio; Mitoraj, Mariusz P.; Gurbanov, Atash V.; Zubkov, Fedor I.; Moosavifar, Maryam; Konyaeva, Irina A.; Kirillov, Alexander M.; Safin, Damir A. |
Journal of publication | New Journal of Chemistry |
Year of publication | 2018 |
Journal volume | 42 |
Journal issue | 7 |
Pages of publication | 4959 |
a | 10.281 ± 0.005 Å |
b | 17.05 ± 0.008 Å |
c | 15.015 ± 0.007 Å |
α | 90° |
β | 106.77 ± 0.03° |
γ | 90° |
Cell volume | 2520 ± 2 Å3 |
Cell temperature | 100 ± 2 K |
Ambient diffraction temperature | 100 ± 2 K |
Number of distinct elements | 5 |
Space group number | 14 |
Hermann-Mauguin space group symbol | P 1 21/c 1 |
Hall space group symbol | -P 2ybc |
Residual factor for all reflections | 0.0403 |
Residual factor for significantly intense reflections | 0.0267 |
Weighted residual factors for significantly intense reflections | 0.0625 |
Weighted residual factors for all reflections included in the refinement | 0.0684 |
Goodness-of-fit parameter for all reflections included in the refinement | 1.055 |
Diffraction radiation wavelength | 0.71073 Å |
Diffraction radiation type | MoKα |