Information card for entry 7057054
Formula | C15 H16 N10 O13 Pb2 |
Calculated formula | C15 H16 N10 O13 Pb2 |
Title of publication | Extended lead(ii) architectures engineered via tetrel bonding interactions |
Authors of publication | Mahmoudi, Ghodrat; Zangrando, Ennio; Mitoraj, Mariusz P.; Gurbanov, Atash V.; Zubkov, Fedor I.; Moosavifar, Maryam; Konyaeva, Irina A.; Kirillov, Alexander M.; Safin, Damir A. |
Journal of publication | New Journal of Chemistry |
Year of publication | 2018 |
Journal volume | 42 |
Journal issue | 7 |
Pages of publication | 4959 |
a | 25.62 ± 0.003 Å |
b | 8.762 ± 0.002 Å |
c | 11.862 ± 0.004 Å |
α | 90° |
β | 111.828 ± 0.017° |
γ | 90° |
Cell volume | 2471.9 ± 1.1 Å3 |
Cell temperature | 294 ± 2 K |
Ambient diffraction temperature | 294 ± 2 K |
Number of distinct elements | 5 |
Space group number | 15 |
Hermann-Mauguin space group symbol | C 1 2/c 1 |
Hall space group symbol | -C 2yc |
Residual factor for all reflections | 0.0713 |
Residual factor for significantly intense reflections | 0.0547 |
Weighted residual factors for significantly intense reflections | 0.135 |
Weighted residual factors for all reflections included in the refinement | 0.1451 |
Goodness-of-fit parameter for all reflections included in the refinement | 1.062 |
Diffraction radiation wavelength | 0.71073 Å |
Diffraction radiation type | MoKα |