Information card for entry 7057071
Formula | C16 H28 Br Co N2 O3 P2 |
Calculated formula | C16 H28 Br Co N2 O3 P2 |
Title of publication | Bis(formylpyrrolyl) cobalt complexes as mediators in the reversible-deactivation radical polymerization of styrene and methyl methacrylate |
Authors of publication | Cruz, Tiago F. C.; Machado, Pedro M. M.; Gomes, Clara S. B.; Ascenso, José R.; Lemos, M. Amélia N. D. A.; Bordado, João C.; Gomes, Pedro T. |
Journal of publication | New Journal of Chemistry |
Year of publication | 2018 |
Journal volume | 42 |
Journal issue | 8 |
Pages of publication | 5900 |
a | 12.521 ± 0.003 Å |
b | 9.249 ± 0.002 Å |
c | 18.569 ± 0.004 Å |
α | 90° |
β | 90° |
γ | 90° |
Cell volume | 2150.4 ± 0.8 Å3 |
Cell temperature | 150 ± 2 K |
Ambient diffraction temperature | 150 ± 2 K |
Number of distinct elements | 7 |
Space group number | 19 |
Hermann-Mauguin space group symbol | P 21 21 21 |
Hall space group symbol | P 2ac 2ab |
Residual factor for all reflections | 0.0645 |
Residual factor for significantly intense reflections | 0.0382 |
Weighted residual factors for significantly intense reflections | 0.0584 |
Weighted residual factors for all reflections included in the refinement | 0.0625 |
Goodness-of-fit parameter for all reflections included in the refinement | 1.013 |
Diffraction radiation probe | x-ray |
Diffraction radiation wavelength | 0.71073 Å |
Diffraction radiation type | MoKα |