Information card for entry 7057072
Formula | C41 H48 B Cl2 Co N2 O2 P2 |
Calculated formula | C41 H48 B Cl2 Co N2 O2 P2 |
Title of publication | Bis(formylpyrrolyl) cobalt complexes as mediators in the reversible-deactivation radical polymerization of styrene and methyl methacrylate |
Authors of publication | Cruz, Tiago F. C.; Machado, Pedro M. M.; Gomes, Clara S. B.; Ascenso, José R.; Lemos, M. Amélia N. D. A.; Bordado, João C.; Gomes, Pedro T. |
Journal of publication | New Journal of Chemistry |
Year of publication | 2018 |
Journal volume | 42 |
Journal issue | 8 |
Pages of publication | 5900 |
a | 11.2435 ± 0.0005 Å |
b | 11.6245 ± 0.0005 Å |
c | 16.9612 ± 0.0008 Å |
α | 92.816 ± 0.002° |
β | 90.895 ± 0.001° |
γ | 112.274 ± 0.002° |
Cell volume | 2047.53 ± 0.16 Å3 |
Cell temperature | 150 ± 2 K |
Ambient diffraction temperature | 150 ± 2 K |
Number of distinct elements | 8 |
Space group number | 2 |
Hermann-Mauguin space group symbol | P -1 |
Hall space group symbol | -P 1 |
Residual factor for all reflections | 0.1005 |
Residual factor for significantly intense reflections | 0.0624 |
Weighted residual factors for significantly intense reflections | 0.1403 |
Weighted residual factors for all reflections included in the refinement | 0.1572 |
Goodness-of-fit parameter for all reflections included in the refinement | 0.954 |
Diffraction radiation probe | x-ray |
Diffraction radiation wavelength | 0.71073 Å |
Diffraction radiation type | MoKα |