Information card for entry 7057074
Formula | C34 H32 O |
Calculated formula | C34 H32 O |
Title of publication | Efficient synthesis of 5-oxatruxene and the unusual influence of oxygen heteroatom on its physico-chemical properties |
Authors of publication | Górski, Krzysztof; Mech-Piskorz, Justyna; Noworyta, Krzysztof; LeÅ›niewska, Barbara; Pietraszkiewicz, Marek |
Journal of publication | New Journal of Chemistry |
Year of publication | 2018 |
Journal volume | 42 |
Journal issue | 8 |
Pages of publication | 5844 |
a | 10.3943 ± 0.0005 Å |
b | 19.4103 ± 0.0009 Å |
c | 12.1847 ± 0.0006 Å |
α | 90° |
β | 95.169 ± 0.004° |
γ | 90° |
Cell volume | 2448.3 ± 0.2 Å3 |
Cell temperature | 100 ± 0.1 K |
Ambient diffraction temperature | 100 ± 0.1 K |
Number of distinct elements | 3 |
Space group number | 14 |
Hermann-Mauguin space group symbol | P 1 21/n 1 |
Hall space group symbol | -P 2yn |
Residual factor for all reflections | 0.0361 |
Residual factor for significantly intense reflections | 0.0351 |
Weighted residual factors for significantly intense reflections | 0.0884 |
Weighted residual factors for all reflections included in the refinement | 0.0892 |
Goodness-of-fit parameter for all reflections included in the refinement | 1.007 |
Diffraction radiation wavelength | 1.54184 Å |
Diffraction radiation type | CuKα |