Information card for entry 7057073
Formula | C16 H26 B Co F4 N2 O2 P2 |
Calculated formula | C16 H26 B Co F4 N2 O2 P2 |
Title of publication | Bis(formylpyrrolyl) cobalt complexes as mediators in the reversible-deactivation radical polymerization of styrene and methyl methacrylate |
Authors of publication | Cruz, Tiago F. C.; Machado, Pedro M. M.; Gomes, Clara S. B.; Ascenso, José R.; Lemos, M. Amélia N. D. A.; Bordado, João C.; Gomes, Pedro T. |
Journal of publication | New Journal of Chemistry |
Year of publication | 2018 |
Journal volume | 42 |
Journal issue | 8 |
Pages of publication | 5900 |
a | 20.429 ± 0.008 Å |
b | 12.23 ± 0.005 Å |
c | 10.184 ± 0.004 Å |
α | 90° |
β | 117.496 ± 0.012° |
γ | 90° |
Cell volume | 2257 ± 1.6 Å3 |
Cell temperature | 150 ± 2 K |
Ambient diffraction temperature | 150 ± 2 K |
Number of distinct elements | 8 |
Space group number | 15 |
Hermann-Mauguin space group symbol | C 1 2/c 1 |
Hall space group symbol | -C 2yc |
Residual factor for all reflections | 0.0603 |
Residual factor for significantly intense reflections | 0.0543 |
Weighted residual factors for significantly intense reflections | 0.1537 |
Weighted residual factors for all reflections included in the refinement | 0.1617 |
Goodness-of-fit parameter for all reflections included in the refinement | 1.117 |
Diffraction radiation probe | x-ray |
Diffraction radiation wavelength | 0.71073 Å |
Diffraction radiation type | MoKα |