Information card for entry 7057076
Formula | C63 H56 Cl8 N8 P2 Rh2 |
Calculated formula | C63 H56 Cl8 N8 P2 Rh2 |
Title of publication | Redox-active diaminoazobenzene complexes of rhodium(iii): synthesis, structure and spectroscopic characterization |
Authors of publication | Roy, Sima; Pramanik, Shuvam; Ghorui, Tapas; Dinda, Soumitra; Patra, Sarat Chandra; Pramanik, Kausikisankar |
Journal of publication | New Journal of Chemistry |
Year of publication | 2018 |
Journal volume | 42 |
Journal issue | 7 |
Pages of publication | 5548 |
a | 19.6187 ± 0.0009 Å |
b | 12.5476 ± 0.0006 Å |
c | 25.9749 ± 0.0012 Å |
α | 90° |
β | 93.411 ± 0.002° |
γ | 90° |
Cell volume | 6382.9 ± 0.5 Å3 |
Cell temperature | 298 ± 2 K |
Ambient diffraction temperature | 298 ± 2 K |
Number of distinct elements | 6 |
Space group number | 14 |
Hermann-Mauguin space group symbol | P 1 21/n 1 |
Hall space group symbol | -P 2yn |
Residual factor for all reflections | 0.0857 |
Residual factor for significantly intense reflections | 0.0565 |
Weighted residual factors for significantly intense reflections | 0.1521 |
Weighted residual factors for all reflections included in the refinement | 0.1749 |
Goodness-of-fit parameter for all reflections included in the refinement | 1.077 |
Diffraction radiation wavelength | 0.71073 Å |
Diffraction radiation type | MoKα |