Information card for entry 7057077
Formula | C32 H30 Cl6 N4 P Rh |
Calculated formula | C32 H30 Cl6 N4 P Rh |
Title of publication | Redox-active diaminoazobenzene complexes of rhodium(iii): synthesis, structure and spectroscopic characterization |
Authors of publication | Roy, Sima; Pramanik, Shuvam; Ghorui, Tapas; Dinda, Soumitra; Patra, Sarat Chandra; Pramanik, Kausikisankar |
Journal of publication | New Journal of Chemistry |
Year of publication | 2018 |
Journal volume | 42 |
Journal issue | 7 |
Pages of publication | 5548 |
a | 10.8829 ± 0.0009 Å |
b | 12.4756 ± 0.001 Å |
c | 14.0207 ± 0.0012 Å |
α | 70.126 ± 0.005° |
β | 89.504 ± 0.005° |
γ | 78.191 ± 0.005° |
Cell volume | 1748.5 ± 0.3 Å3 |
Cell temperature | 298 ± 2 K |
Ambient diffraction temperature | 298 ± 2 K |
Number of distinct elements | 6 |
Space group number | 2 |
Hermann-Mauguin space group symbol | P -1 |
Hall space group symbol | -P 1 |
Residual factor for all reflections | 0.0819 |
Residual factor for significantly intense reflections | 0.048 |
Weighted residual factors for significantly intense reflections | 0.1221 |
Weighted residual factors for all reflections included in the refinement | 0.1376 |
Goodness-of-fit parameter for all reflections included in the refinement | 1.016 |
Diffraction radiation wavelength | 0.71073 Å |
Diffraction radiation type | MoKα |