Information card for entry 7057080
Formula | C8 H16 N2 O8 P2 |
Calculated formula | C8 H16 N2 O8 P2 |
Title of publication | 1D Co(ii) coordination polymers based on cyclobutyl- and cyclopentyl-substituted zoledronate analogues: synthesis, structural comparison, thermal stability and magnetic properties |
Authors of publication | Rojek, Tomasz; Goldeman, Waldemar; Ślepokura, Katarzyna; Duczmal, Marek; Wojciechowska, Agnieszka; Matczak-Jon, Ewa |
Journal of publication | New Journal of Chemistry |
Year of publication | 2018 |
Journal volume | 42 |
Journal issue | 10 |
Pages of publication | 7830 |
a | 7.695 ± 0.003 Å |
b | 7.92 ± 0.003 Å |
c | 10.362 ± 0.003 Å |
α | 96.36 ± 0.03° |
β | 99.93 ± 0.03° |
γ | 91.11 ± 0.03° |
Cell volume | 617.7 ± 0.4 Å3 |
Cell temperature | 100 ± 2 K |
Ambient diffraction temperature | 100 ± 2 K |
Number of distinct elements | 5 |
Space group number | 2 |
Hermann-Mauguin space group symbol | P -1 |
Hall space group symbol | -P 1 |
Residual factor for all reflections | 0.0435 |
Residual factor for significantly intense reflections | 0.0404 |
Weighted residual factors for significantly intense reflections | 0.1186 |
Weighted residual factors for all reflections included in the refinement | 0.1209 |
Goodness-of-fit parameter for all reflections included in the refinement | 1.081 |
Diffraction radiation wavelength | 0.71073 Å |
Diffraction radiation type | MoKα |