Information card for entry 7057081
Formula | C16 H46 Co3 N4 O26 P4 |
Calculated formula | C16 H46 Co3 N4 O26 P4 |
Title of publication | 1D Co(ii) coordination polymers based on cyclobutyl- and cyclopentyl-substituted zoledronate analogues: synthesis, structural comparison, thermal stability and magnetic properties |
Authors of publication | Rojek, Tomasz; Goldeman, Waldemar; Ślepokura, Katarzyna; Duczmal, Marek; Wojciechowska, Agnieszka; Matczak-Jon, Ewa |
Journal of publication | New Journal of Chemistry |
Year of publication | 2018 |
Journal volume | 42 |
Journal issue | 10 |
Pages of publication | 7830 |
a | 10.288 ± 0.003 Å |
b | 9.956 ± 0.003 Å |
c | 10.17 ± 0.003 Å |
α | 80.59 ± 0.03° |
β | 72.36 ± 0.03° |
γ | 61.94 ± 0.03° |
Cell volume | 875.7 ± 0.5 Å3 |
Cell temperature | 100 ± 2 K |
Ambient diffraction temperature | 100 ± 2 K |
Number of distinct elements | 6 |
Space group number | 2 |
Hermann-Mauguin space group symbol | P -1 |
Hall space group symbol | -P 1 |
Residual factor for all reflections | 0.0586 |
Residual factor for significantly intense reflections | 0.0489 |
Weighted residual factors for significantly intense reflections | 0.1319 |
Weighted residual factors for all reflections included in the refinement | 0.1367 |
Goodness-of-fit parameter for all reflections included in the refinement | 1.001 |
Diffraction radiation wavelength | 0.71073 Å |
Diffraction radiation type | MoKα |