Information card for entry 7057084
Formula | C14 H25 Ag4 Cd2 N10 O7 |
Calculated formula | C14 H25 Ag4 Cd2 N10 O7 |
Title of publication | In vitro biological properties and predicted DNA‒BSA interaction of three new dicyanidoargentate(i)-based complexes: synthesis and characterization |
Authors of publication | Karadağ, Ahmet; Korkmaz, Nesrin; Aydın, Ali; Tekin, Şaban; Yanar, Yusuf; Yerli, Yusuf; Korkmaz, Şengül Aslan |
Journal of publication | New Journal of Chemistry |
Year of publication | 2018 |
Journal volume | 42 |
Journal issue | 6 |
Pages of publication | 4679 |
a | 10.9482 ± 0.0007 Å |
b | 11.7177 ± 0.0007 Å |
c | 11.9192 ± 0.0007 Å |
α | 90° |
β | 97.126 ± 0.002° |
γ | 90° |
Cell volume | 1517.28 ± 0.16 Å3 |
Cell temperature | 296 ± 2 K |
Ambient diffraction temperature | 296 ± 2 K |
Number of distinct elements | 6 |
Space group number | 11 |
Hermann-Mauguin space group symbol | P 1 21/m 1 |
Hall space group symbol | -P 2yb |
Residual factor for all reflections | 0.0452 |
Residual factor for significantly intense reflections | 0.0445 |
Weighted residual factors for significantly intense reflections | 0.136 |
Weighted residual factors for all reflections included in the refinement | 0.1364 |
Goodness-of-fit parameter for all reflections included in the refinement | 1.069 |
Diffraction radiation wavelength | 0.71073 Å |
Diffraction radiation type | MoKα |