Information card for entry 7057083
Formula | C9 H24 N2 O11 P2 |
Calculated formula | C9 H24 N2 O11 P2 |
Title of publication | 1D Co(ii) coordination polymers based on cyclobutyl- and cyclopentyl-substituted zoledronate analogues: synthesis, structural comparison, thermal stability and magnetic properties |
Authors of publication | Rojek, Tomasz; Goldeman, Waldemar; Ślepokura, Katarzyna; Duczmal, Marek; Wojciechowska, Agnieszka; Matczak-Jon, Ewa |
Journal of publication | New Journal of Chemistry |
Year of publication | 2018 |
Journal volume | 42 |
Journal issue | 10 |
Pages of publication | 7830 |
a | 6.895 ± 0.002 Å |
b | 16.818 ± 0.006 Å |
c | 14.457 ± 0.006 Å |
α | 90° |
β | 91.27 ± 0.03° |
γ | 90° |
Cell volume | 1676 ± 1 Å3 |
Cell temperature | 100 ± 2 K |
Ambient diffraction temperature | 100 ± 2 K |
Number of distinct elements | 5 |
Space group number | 14 |
Hermann-Mauguin space group symbol | P 1 21/c 1 |
Hall space group symbol | -P 2ybc |
Residual factor for all reflections | 0.0653 |
Residual factor for significantly intense reflections | 0.0605 |
Weighted residual factors for significantly intense reflections | 0.1628 |
Weighted residual factors for all reflections included in the refinement | 0.1678 |
Goodness-of-fit parameter for all reflections included in the refinement | 1.052 |
Diffraction radiation wavelength | 1.5418 Å |
Diffraction radiation type | CuKα |