Information card for entry 7057099
Formula | C70 H108 N4 O25 V6 |
Calculated formula | C70 H108 N4 O25 V6 |
Title of publication | Stepwise syntheses and supramolecular assemblies of a series of polyoxovanadate hybrids with various architectures |
Authors of publication | Huang, Bo; Wang, Nan; Yang, Kang; Ke, Degang; Fang, Yajun; Hu, Xunliang; Wu, Baolin; Xiao, Zicheng; Wu, Pingfan; Wei, Yongge |
Journal of publication | New Journal of Chemistry |
Year of publication | 2018 |
Journal volume | 42 |
Journal issue | 8 |
Pages of publication | 5853 |
a | 12.0059 ± 0.0008 Å |
b | 13.8979 ± 0.0012 Å |
c | 14.0548 ± 0.0007 Å |
α | 66.339 ± 0.006° |
β | 78.031 ± 0.005° |
γ | 67.63 ± 0.007° |
Cell volume | 1982.2 ± 0.3 Å3 |
Cell temperature | 107.2 K |
Ambient diffraction temperature | 107.2 K |
Number of distinct elements | 5 |
Space group number | 2 |
Hermann-Mauguin space group symbol | P -1 |
Hall space group symbol | -P 1 |
Residual factor for all reflections | 0.0769 |
Residual factor for significantly intense reflections | 0.0673 |
Weighted residual factors for significantly intense reflections | 0.1571 |
Weighted residual factors for all reflections included in the refinement | 0.1614 |
Goodness-of-fit parameter for all reflections included in the refinement | 1.175 |
Diffraction radiation wavelength | 0.7107 Å |
Diffraction radiation type | MoKα |