Information card for entry 7057100
Formula | C66 H116 N4 O25 V6 |
Calculated formula | C66 H116 N4 O25 V6 |
Title of publication | Stepwise syntheses and supramolecular assemblies of a series of polyoxovanadate hybrids with various architectures |
Authors of publication | Huang, Bo; Wang, Nan; Yang, Kang; Ke, Degang; Fang, Yajun; Hu, Xunliang; Wu, Baolin; Xiao, Zicheng; Wu, Pingfan; Wei, Yongge |
Journal of publication | New Journal of Chemistry |
Year of publication | 2018 |
Journal volume | 42 |
Journal issue | 8 |
Pages of publication | 5853 |
a | 11.187 ± 0.002 Å |
b | 13.547 ± 0.003 Å |
c | 14.326 ± 0.003 Å |
α | 107.72 ± 0.03° |
β | 94.21 ± 0.03° |
γ | 104.66 ± 0.03° |
Cell volume | 1973.9 ± 0.9 Å3 |
Cell temperature | 293 ± 2 K |
Ambient diffraction temperature | 293 ± 2 K |
Number of distinct elements | 5 |
Space group number | 2 |
Hermann-Mauguin space group symbol | P -1 |
Hall space group symbol | -P 1 |
Residual factor for all reflections | 0.122 |
Residual factor for significantly intense reflections | 0.0772 |
Weighted residual factors for significantly intense reflections | 0.2246 |
Weighted residual factors for all reflections included in the refinement | 0.2798 |
Goodness-of-fit parameter for all reflections included in the refinement | 1.031 |
Diffraction radiation wavelength | 0.71073 Å |
Diffraction radiation type | MoKα |