Information card for entry 7057101
Formula | C64 H108 N4 O25 V6 |
Calculated formula | C64 H108 N4 O25 V6 |
Title of publication | Stepwise syntheses and supramolecular assemblies of a series of polyoxovanadate hybrids with various architectures |
Authors of publication | Huang, Bo; Wang, Nan; Yang, Kang; Ke, Degang; Fang, Yajun; Hu, Xunliang; Wu, Baolin; Xiao, Zicheng; Wu, Pingfan; Wei, Yongge |
Journal of publication | New Journal of Chemistry |
Year of publication | 2018 |
Journal volume | 42 |
Journal issue | 8 |
Pages of publication | 5853 |
a | 13.5838 ± 0.0019 Å |
b | 17.309 ± 0.002 Å |
c | 16.326 ± 0.002 Å |
α | 90° |
β | 101.95 ± 0.002° |
γ | 90° |
Cell volume | 3755.4 ± 0.8 Å3 |
Cell temperature | 273 ± 2 K |
Ambient diffraction temperature | 273.15 K |
Number of distinct elements | 5 |
Space group number | 14 |
Hermann-Mauguin space group symbol | P 1 21/n 1 |
Hall space group symbol | -P 2yn |
Residual factor for all reflections | 0.1495 |
Residual factor for significantly intense reflections | 0.065 |
Weighted residual factors for significantly intense reflections | 0.1617 |
Weighted residual factors for all reflections included in the refinement | 0.2132 |
Goodness-of-fit parameter for all reflections included in the refinement | 1.017 |
Diffraction radiation wavelength | 0.71073 Å |
Diffraction radiation type | MoKα |