Information card for entry 7057108
Formula | C20 H24 N6 O2 Se4 |
Calculated formula | C20 H24 N6 O2 Se4 |
Title of publication | Chalcogen bonding interactions in organic selenocyanates: from cooperativity to chelation |
Authors of publication | Jeannin, Olivier; Huynh, Huu-Tri; Riel, Asia Marie S.; Fourmigué, Marc |
Journal of publication | New Journal of Chemistry |
Year of publication | 2018 |
Journal volume | 42 |
Journal issue | 13 |
Pages of publication | 10502 |
a | 9.224 ± 0.005 Å |
b | 9.382 ± 0.005 Å |
c | 9.591 ± 0.005 Å |
α | 108.086 ± 0.015° |
β | 116.283 ± 0.014° |
γ | 102.687 ± 0.015° |
Cell volume | 642.3 ± 0.6 Å3 |
Cell temperature | 296 ± 2 K |
Ambient diffraction temperature | 296 ± 2 K |
Number of distinct elements | 5 |
Space group number | 2 |
Hermann-Mauguin space group symbol | P -1 |
Hall space group symbol | -P 1 |
Residual factor for all reflections | 0.0635 |
Residual factor for significantly intense reflections | 0.04 |
Weighted residual factors for significantly intense reflections | 0.0808 |
Weighted residual factors for all reflections included in the refinement | 0.0905 |
Goodness-of-fit parameter for all reflections included in the refinement | 1.118 |
Diffraction radiation probe | x-ray |
Diffraction radiation wavelength | 0.71073 Å |
Diffraction radiation type | MoKα |