Information card for entry 7057109
Formula | C19 H23 N3 O2 Se3 |
Calculated formula | C19 H23 N3 O2 Se3 |
Title of publication | Chalcogen bonding interactions in organic selenocyanates: from cooperativity to chelation |
Authors of publication | Jeannin, Olivier; Huynh, Huu-Tri; Riel, Asia Marie S.; Fourmigué, Marc |
Journal of publication | New Journal of Chemistry |
Year of publication | 2018 |
Journal volume | 42 |
Journal issue | 13 |
Pages of publication | 10502 |
a | 18.5055 ± 0.0017 Å |
b | 10.3314 ± 0.0009 Å |
c | 23.327 ± 0.002 Å |
α | 90° |
β | 107.551 ± 0.004° |
γ | 90° |
Cell volume | 4252.2 ± 0.7 Å3 |
Cell temperature | 150 ± 2 K |
Ambient diffraction temperature | 150 ± 2 K |
Number of distinct elements | 5 |
Space group number | 15 |
Hermann-Mauguin space group symbol | C 1 2/c 1 |
Hall space group symbol | -C 2yc |
Residual factor for all reflections | 0.0485 |
Residual factor for significantly intense reflections | 0.0342 |
Weighted residual factors for significantly intense reflections | 0.0741 |
Weighted residual factors for all reflections included in the refinement | 0.0816 |
Goodness-of-fit parameter for all reflections included in the refinement | 1.06 |
Diffraction radiation probe | x-ray |
Diffraction radiation wavelength | 0.71073 Å |
Diffraction radiation type | MoKα |