Information card for entry 7057134
Formula | C58 H68 Cl N13 Ni4 O22 |
Calculated formula | C58 H68 Cl N13 Ni4 O22 |
Title of publication | Octadentate flexible ligands as a platform for a variety of homo and heterometallic complexes containing diphenoxido and phenoxido/azido bridging groups: synthesis, structure and magnetic properties |
Authors of publication | Pramanik, Koushik; Malpaharia, Pijush; Colacio, Enrique; Das, Babulal; Chandra, Swapan K. |
Journal of publication | New Journal of Chemistry |
Year of publication | 2018 |
Journal volume | 42 |
Journal issue | 8 |
Pages of publication | 6332 |
a | 11.971 ± 0.0003 Å |
b | 17.2506 ± 0.0004 Å |
c | 32.9419 ± 0.0007 Å |
α | 90° |
β | 90° |
γ | 90° |
Cell volume | 6802.7 ± 0.3 Å3 |
Cell temperature | 296 ± 2 K |
Ambient diffraction temperature | 296 ± 2 K |
Number of distinct elements | 6 |
Space group number | 60 |
Hermann-Mauguin space group symbol | P b c n |
Hall space group symbol | -P 2n 2ab |
Residual factor for all reflections | 0.1331 |
Residual factor for significantly intense reflections | 0.0618 |
Weighted residual factors for significantly intense reflections | 0.155 |
Weighted residual factors for all reflections included in the refinement | 0.1936 |
Goodness-of-fit parameter for all reflections included in the refinement | 1.019 |
Diffraction radiation wavelength | 0.71073 Å |
Diffraction radiation type | MoKα |