Information card for entry 7057135
Formula | C33 H38 Mn2 N9 O13 |
Calculated formula | C33 H38 Mn2 N9 O13 |
Title of publication | Octadentate flexible ligands as a platform for a variety of homo and heterometallic complexes containing diphenoxido and phenoxido/azido bridging groups: synthesis, structure and magnetic properties |
Authors of publication | Pramanik, Koushik; Malpaharia, Pijush; Colacio, Enrique; Das, Babulal; Chandra, Swapan K. |
Journal of publication | New Journal of Chemistry |
Year of publication | 2018 |
Journal volume | 42 |
Journal issue | 8 |
Pages of publication | 6332 |
a | 10.5528 ± 0.0004 Å |
b | 10.6347 ± 0.0004 Å |
c | 18.9784 ± 0.0006 Å |
α | 86.458 ± 0.001° |
β | 76.235 ± 0.001° |
γ | 63.588 ± 0.001° |
Cell volume | 1850.39 ± 0.12 Å3 |
Cell temperature | 296 ± 2 K |
Ambient diffraction temperature | 296 ± 2 K |
Number of distinct elements | 5 |
Space group number | 2 |
Hermann-Mauguin space group symbol | P -1 |
Hall space group symbol | -P 1 |
Residual factor for all reflections | 0.0602 |
Residual factor for significantly intense reflections | 0.0454 |
Weighted residual factors for significantly intense reflections | 0.1413 |
Weighted residual factors for all reflections included in the refinement | 0.1527 |
Goodness-of-fit parameter for all reflections included in the refinement | 1.264 |
Diffraction radiation wavelength | 0.71073 Å |
Diffraction radiation type | MoKα |