Information card for entry 7057137
Formula | C23 H22 Cl N O2 Pd Te |
Calculated formula | C23 H22 Cl N O2 Pd Te |
Title of publication | Synthesis, characterization and determination of absolute structures of palladium complexes of novel chiral acyclic tellurated Schiff base ligands |
Authors of publication | Rajegowda, H. R.; Kumar, P. Raghavendra; Hosamani, Amar; Butcher, R. J. |
Journal of publication | New Journal of Chemistry |
Year of publication | 2018 |
Journal volume | 42 |
Journal issue | 8 |
Pages of publication | 6264 |
a | 13.836 ± 0.003 Å |
b | 16.505 ± 0.003 Å |
c | 20.607 ± 0.004 Å |
α | 90° |
β | 90° |
γ | 90° |
Cell volume | 4705.9 ± 1.6 Å3 |
Cell temperature | 296 ± 2 K |
Ambient diffraction temperature | 296 ± 2 K |
Number of distinct elements | 7 |
Space group number | 19 |
Hermann-Mauguin space group symbol | P 21 21 21 |
Hall space group symbol | P 2ac 2ab |
Residual factor for all reflections | 0.1137 |
Residual factor for significantly intense reflections | 0.0785 |
Weighted residual factors for significantly intense reflections | 0.1724 |
Weighted residual factors for all reflections included in the refinement | 0.1952 |
Goodness-of-fit parameter for all reflections included in the refinement | 0.993 |
Diffraction radiation wavelength | 1.54178 Å |
Diffraction radiation type | CuKα |