Information card for entry 7057136
Formula | C17 H18 Cl N O2 Pd Te |
Calculated formula | C17 H18 Cl N O2 Pd Te |
Title of publication | Synthesis, characterization and determination of absolute structures of palladium complexes of novel chiral acyclic tellurated Schiff base ligands |
Authors of publication | Rajegowda, H. R.; Kumar, P. Raghavendra; Hosamani, Amar; Butcher, R. J. |
Journal of publication | New Journal of Chemistry |
Year of publication | 2018 |
Journal volume | 42 |
Journal issue | 8 |
Pages of publication | 6264 |
a | 12.3508 ± 0.0004 Å |
b | 12.3508 ± 0.0004 Å |
c | 22.9876 ± 0.0011 Å |
α | 90° |
β | 90° |
γ | 120° |
Cell volume | 3036.8 ± 0.2 Å3 |
Cell temperature | 100 ± 2 K |
Ambient diffraction temperature | 100 ± 2 K |
Number of distinct elements | 7 |
Space group number | 170 |
Hermann-Mauguin space group symbol | P 65 |
Hall space group symbol | P 65 |
Residual factor for all reflections | 0.0598 |
Residual factor for significantly intense reflections | 0.0436 |
Weighted residual factors for significantly intense reflections | 0.0777 |
Weighted residual factors for all reflections included in the refinement | 0.0828 |
Goodness-of-fit parameter for all reflections included in the refinement | 0.954 |
Diffraction radiation wavelength | 0.71073 Å |
Diffraction radiation type | MoKα |