Information card for entry 7057147
Formula | C28 H28 N4 O4 Zn |
Calculated formula | C28 H24 N4 O4 Zn |
Title of publication | Exploring the multifunctionality in metal‒organic framework materials: how do the stilbenedicarboxylate and imidazolyl ligands tune the characteristics of coordination polymers? |
Authors of publication | Barsukova, Marina O.; Sapchenko, Sergey A.; Kovalenko, Konstantin A.; Samsonenko, Denis G.; Potapov, Andrei S.; Dybtsev, Danil N.; Fedin, Vladimir P. |
Journal of publication | New Journal of Chemistry |
Year of publication | 2018 |
Journal volume | 42 |
Journal issue | 8 |
Pages of publication | 6408 |
a | 8.688 ± 0.0004 Å |
b | 14.6001 ± 0.0006 Å |
c | 23.4501 ± 0.0011 Å |
α | 90° |
β | 90° |
γ | 90° |
Cell volume | 2974.5 ± 0.2 Å3 |
Cell temperature | 130 ± 2 K |
Ambient diffraction temperature | 130 ± 2 K |
Number of distinct elements | 5 |
Space group number | 60 |
Hermann-Mauguin space group symbol | P b c n |
Hall space group symbol | -P 2n 2ab |
Residual factor for all reflections | 0.1037 |
Residual factor for significantly intense reflections | 0.0805 |
Weighted residual factors for significantly intense reflections | 0.2273 |
Weighted residual factors for all reflections included in the refinement | 0.2496 |
Goodness-of-fit parameter for all reflections included in the refinement | 1.063 |
Diffraction radiation probe | x-ray |
Diffraction radiation wavelength | 0.71073 Å |
Diffraction radiation type | MoKα |