Information card for entry 7057146
Formula | C29 H31 Co N5 O5 |
Calculated formula | C29 H24 Co N5 O5 |
Title of publication | Exploring the multifunctionality in metal‒organic framework materials: how do the stilbenedicarboxylate and imidazolyl ligands tune the characteristics of coordination polymers? |
Authors of publication | Barsukova, Marina O.; Sapchenko, Sergey A.; Kovalenko, Konstantin A.; Samsonenko, Denis G.; Potapov, Andrei S.; Dybtsev, Danil N.; Fedin, Vladimir P. |
Journal of publication | New Journal of Chemistry |
Year of publication | 2018 |
Journal volume | 42 |
Journal issue | 8 |
Pages of publication | 6408 |
a | 11.4594 ± 0.0003 Å |
b | 6.5882 ± 0.0002 Å |
c | 18.3365 ± 0.0005 Å |
α | 90° |
β | 92.145 ± 0.003° |
γ | 90° |
Cell volume | 1383.38 ± 0.07 Å3 |
Cell temperature | 130 ± 2 K |
Ambient diffraction temperature | 130 ± 2 K |
Number of distinct elements | 5 |
Space group number | 13 |
Hermann-Mauguin space group symbol | P 1 2/c 1 |
Hall space group symbol | -P 2yc |
Residual factor for all reflections | 0.0526 |
Residual factor for significantly intense reflections | 0.0404 |
Weighted residual factors for significantly intense reflections | 0.1032 |
Weighted residual factors for all reflections included in the refinement | 0.1094 |
Goodness-of-fit parameter for all reflections included in the refinement | 1.084 |
Diffraction radiation probe | x-ray |
Diffraction radiation wavelength | 0.71073 Å |
Diffraction radiation type | MoKα |