Information card for entry 7057169
Formula | C23 H25 I2 N2 O2 Se |
Calculated formula | C23 H25 I2 N2 O2 Se |
Title of publication | Cyanine dyes: synergistic action of hydrogen, halogen and chalcogen bonds allows discrete I42− anions in crystals |
Authors of publication | Konidaris, Konstantis F.; Pilati, Tullio; Terraneo, Giancarlo; Politzer, Peter; Murray, Jane S.; Scilabra, Patrick; Resnati, Giuseppe |
Journal of publication | New Journal of Chemistry |
Year of publication | 2018 |
Journal volume | 42 |
Journal issue | 13 |
Pages of publication | 10463 |
a | 7.634 ± 0.006 Å |
b | 11.179 ± 0.011 Å |
c | 15.757 ± 0.013 Å |
α | 75.93 ± 0.06° |
β | 79.26 ± 0.05° |
γ | 70.09 ± 0.04° |
Cell volume | 1218.5 ± 1.9 Å3 |
Cell temperature | 296 ± 2 K |
Ambient diffraction temperature | 296 ± 2 K |
Number of distinct elements | 6 |
Space group number | 2 |
Hermann-Mauguin space group symbol | P -1 |
Hall space group symbol | -P 1 |
Residual factor for all reflections | 0.1043 |
Residual factor for significantly intense reflections | 0.0491 |
Weighted residual factors for significantly intense reflections | 0.0982 |
Weighted residual factors for all reflections included in the refinement | 0.1171 |
Goodness-of-fit parameter for all reflections included in the refinement | 0.908 |
Diffraction radiation wavelength | 0.71073 Å |
Diffraction radiation type | MoKα |