Information card for entry 7057170
Formula | C61 H66 Cl2 N4 O8 S2 Se2 |
Calculated formula | C61 H66 Cl2 N4 O8 S2 Se2 |
Title of publication | Cyanine dyes: synergistic action of hydrogen, halogen and chalcogen bonds allows discrete I42− anions in crystals |
Authors of publication | Konidaris, Konstantis F.; Pilati, Tullio; Terraneo, Giancarlo; Politzer, Peter; Murray, Jane S.; Scilabra, Patrick; Resnati, Giuseppe |
Journal of publication | New Journal of Chemistry |
Year of publication | 2018 |
Journal volume | 42 |
Journal issue | 13 |
Pages of publication | 10463 |
a | 8.008 ± 0.007 Å |
b | 11.38 ± 0.009 Å |
c | 17.301 ± 0.013 Å |
α | 74.32 ± 0.03° |
β | 86.43 ± 0.02° |
γ | 70.07 ± 0.02° |
Cell volume | 1426 ± 2 Å3 |
Cell temperature | 100 ± 2 K |
Ambient diffraction temperature | 100 ± 2 K |
Number of distinct elements | 7 |
Space group number | 2 |
Hermann-Mauguin space group symbol | P -1 |
Hall space group symbol | -P 1 |
Residual factor for all reflections | 0.1201 |
Residual factor for significantly intense reflections | 0.0595 |
Weighted residual factors for significantly intense reflections | 0.1184 |
Weighted residual factors for all reflections included in the refinement | 0.1425 |
Goodness-of-fit parameter for all reflections included in the refinement | 1.009 |
Diffraction radiation wavelength | 0.71073 Å |
Diffraction radiation type | MoKα |