Information card for entry 7057180
Formula | C24 H20 N2 O10 Ru3 |
Calculated formula | C24 H20 N2 O10 Ru3 |
Title of publication | Ruthenium carbonyl complexes with pyridylalkanol ligands: synthesis, characterization and catalytic properties for aerobic oxidation of secondary alcohols |
Authors of publication | Hao, Zhiqiang; Li, Ning; Yan, Xinlong; Li, Ying; Zong, Siqi; Liu, Huating; Han, Zhangang; Lin, Jin |
Journal of publication | New Journal of Chemistry |
Year of publication | 2018 |
Journal volume | 42 |
Journal issue | 9 |
Pages of publication | 6968 |
a | 11.2284 ± 0.0009 Å |
b | 15.3788 ± 0.0012 Å |
c | 15.7738 ± 0.0013 Å |
α | 90° |
β | 90° |
γ | 90° |
Cell volume | 2723.8 ± 0.4 Å3 |
Cell temperature | 298 ± 2 K |
Ambient diffraction temperature | 298 ± 2 K |
Number of distinct elements | 5 |
Space group number | 19 |
Hermann-Mauguin space group symbol | P 21 21 21 |
Hall space group symbol | P 2ac 2ab |
Residual factor for all reflections | 0.0256 |
Residual factor for significantly intense reflections | 0.0216 |
Weighted residual factors for significantly intense reflections | 0.05 |
Weighted residual factors for all reflections included in the refinement | 0.0523 |
Goodness-of-fit parameter for all reflections included in the refinement | 1.149 |
Diffraction radiation wavelength | 0.71073 Å |
Diffraction radiation type | MoKα |