Information card for entry 7057181
Formula | C28 H24 N2 O10 Ru3 |
Calculated formula | C28 H24 N2 O10 Ru3 |
Title of publication | Ruthenium carbonyl complexes with pyridylalkanol ligands: synthesis, characterization and catalytic properties for aerobic oxidation of secondary alcohols |
Authors of publication | Hao, Zhiqiang; Li, Ning; Yan, Xinlong; Li, Ying; Zong, Siqi; Liu, Huating; Han, Zhangang; Lin, Jin |
Journal of publication | New Journal of Chemistry |
Year of publication | 2018 |
Journal volume | 42 |
Journal issue | 9 |
Pages of publication | 6968 |
a | 12.0348 ± 0.0013 Å |
b | 12.0348 ± 0.0013 Å |
c | 21.3648 ± 0.0017 Å |
α | 90° |
β | 90° |
γ | 90° |
Cell volume | 3094.4 ± 0.5 Å3 |
Cell temperature | 298 ± 2 K |
Ambient diffraction temperature | 298 ± 2 K |
Number of distinct elements | 5 |
Space group number | 96 |
Hermann-Mauguin space group symbol | P 43 21 2 |
Hall space group symbol | P 4nw 2abw |
Residual factor for all reflections | 0.0482 |
Residual factor for significantly intense reflections | 0.0335 |
Weighted residual factors for significantly intense reflections | 0.0784 |
Weighted residual factors for all reflections included in the refinement | 0.0884 |
Goodness-of-fit parameter for all reflections included in the refinement | 1.087 |
Diffraction radiation wavelength | 0.71073 Å |
Diffraction radiation type | MoKα |