Information card for entry 7057184
Formula | C32 H18 Br2 N2 O10 Ru3 |
Calculated formula | C32 H18 Br2 N2 O10 Ru3 |
Title of publication | Ruthenium carbonyl complexes with pyridylalkanol ligands: synthesis, characterization and catalytic properties for aerobic oxidation of secondary alcohols |
Authors of publication | Hao, Zhiqiang; Li, Ning; Yan, Xinlong; Li, Ying; Zong, Siqi; Liu, Huating; Han, Zhangang; Lin, Jin |
Journal of publication | New Journal of Chemistry |
Year of publication | 2018 |
Journal volume | 42 |
Journal issue | 9 |
Pages of publication | 6968 |
a | 16.4503 ± 0.0014 Å |
b | 10.8605 ± 0.0009 Å |
c | 20.7249 ± 0.0017 Å |
α | 90° |
β | 106.928 ± 0.002° |
γ | 90° |
Cell volume | 3542.2 ± 0.5 Å3 |
Cell temperature | 298 ± 2 K |
Ambient diffraction temperature | 298 ± 2 K |
Number of distinct elements | 6 |
Space group number | 14 |
Hermann-Mauguin space group symbol | P 1 21/n 1 |
Hall space group symbol | -P 2yn |
Residual factor for all reflections | 0.0717 |
Residual factor for significantly intense reflections | 0.0399 |
Weighted residual factors for significantly intense reflections | 0.0835 |
Weighted residual factors for all reflections included in the refinement | 0.0941 |
Goodness-of-fit parameter for all reflections included in the refinement | 1.014 |
Diffraction radiation wavelength | 0.71073 Å |
Diffraction radiation type | MoKα |