Information card for entry 7057183
Formula | C32 H20 N2 O10 Ru3 |
Calculated formula | C32 H20 N2 O10 Ru3 |
Title of publication | Ruthenium carbonyl complexes with pyridylalkanol ligands: synthesis, characterization and catalytic properties for aerobic oxidation of secondary alcohols |
Authors of publication | Hao, Zhiqiang; Li, Ning; Yan, Xinlong; Li, Ying; Zong, Siqi; Liu, Huating; Han, Zhangang; Lin, Jin |
Journal of publication | New Journal of Chemistry |
Year of publication | 2018 |
Journal volume | 42 |
Journal issue | 9 |
Pages of publication | 6968 |
a | 14.677 ± 0.004 Å |
b | 14.677 ± 0.004 Å |
c | 29.911 ± 0.016 Å |
α | 90° |
β | 90° |
γ | 90° |
Cell volume | 6443 ± 4 Å3 |
Cell temperature | 298 ± 2 K |
Ambient diffraction temperature | 298 ± 2 K |
Number of distinct elements | 5 |
Space group number | 122 |
Hermann-Mauguin space group symbol | I -4 2 d |
Hall space group symbol | I -4 2bw |
Residual factor for all reflections | 0.0764 |
Residual factor for significantly intense reflections | 0.0466 |
Weighted residual factors for significantly intense reflections | 0.1069 |
Weighted residual factors for all reflections included in the refinement | 0.1323 |
Goodness-of-fit parameter for all reflections included in the refinement | 1.158 |
Diffraction radiation wavelength | 0.71073 Å |
Diffraction radiation type | MoKα |