Information card for entry 7057193
Chemical name | 4 |
Formula | C30 H26 Cu4 I4 N6 |
Calculated formula | C30 H26 Cu4 I4 N6 |
Title of publication | Substituent regulated photoluminescent thermochromism in a rare type of octahedral Cu4I4 clusters |
Authors of publication | Yu, Ya-Dong; Meng, Ling-Bin; Chen, Qiu-Cheng; Chen, Guang-Hui; Huang, Xiao-Chun |
Journal of publication | New Journal of Chemistry |
Year of publication | 2018 |
Journal volume | 42 |
Journal issue | 11 |
Pages of publication | 8426 |
a | 8.3998 ± 0.0006 Å |
b | 9.9053 ± 0.0005 Å |
c | 10.7689 ± 0.0006 Å |
α | 96.49 ± 0.005° |
β | 91.848 ± 0.005° |
γ | 105.378 ± 0.006° |
Cell volume | 856.57 ± 0.09 Å3 |
Cell temperature | 293 ± 2 K |
Ambient diffraction temperature | 293 ± 2 K |
Number of distinct elements | 5 |
Space group number | 2 |
Hermann-Mauguin space group symbol | P -1 |
Hall space group symbol | -P 1 |
Residual factor for all reflections | 0.048 |
Residual factor for significantly intense reflections | 0.0316 |
Weighted residual factors for significantly intense reflections | 0.0529 |
Weighted residual factors for all reflections included in the refinement | 0.0596 |
Goodness-of-fit parameter for all reflections included in the refinement | 1.007 |
Diffraction radiation wavelength | 0.71073 Å |
Diffraction radiation type | MoKα |