Information card for entry 7057194
Chemical name | 4-LT |
Formula | C30 H26 Cu4 I4 N6 |
Calculated formula | C30 H26 Cu4 I4 N6 |
Title of publication | Substituent regulated photoluminescent thermochromism in a rare type of octahedral Cu4I4 clusters |
Authors of publication | Yu, Ya-Dong; Meng, Ling-Bin; Chen, Qiu-Cheng; Chen, Guang-Hui; Huang, Xiao-Chun |
Journal of publication | New Journal of Chemistry |
Year of publication | 2018 |
Journal volume | 42 |
Journal issue | 11 |
Pages of publication | 8426 |
a | 8.274 ± 0.0004 Å |
b | 9.8472 ± 0.0004 Å |
c | 10.7436 ± 0.0005 Å |
α | 96.543 ± 0.002° |
β | 91.051 ± 0.002° |
γ | 105.758 ± 0.002° |
Cell volume | 835.85 ± 0.07 Å3 |
Cell temperature | 100 ± 2 K |
Ambient diffraction temperature | 100 ± 2 K |
Number of distinct elements | 5 |
Space group number | 2 |
Hermann-Mauguin space group symbol | P -1 |
Hall space group symbol | -P 1 |
Residual factor for all reflections | 0.0332 |
Residual factor for significantly intense reflections | 0.0301 |
Weighted residual factors for significantly intense reflections | 0.0957 |
Weighted residual factors for all reflections included in the refinement | 0.0997 |
Goodness-of-fit parameter for all reflections included in the refinement | 1.041 |
Diffraction radiation wavelength | 1.54178 Å |
Diffraction radiation type | CuKα |