Information card for entry 7057201
Formula | C43 H46 N4 O5 P2 Ru |
Calculated formula | C43 H46 N4 O5 P2 Ru |
Title of publication | Ru(ii)‒thyminate complexes: new metallodrug candidates against tumor cells |
Authors of publication | Correa, Rodrigo S.; Freire, Vitória; Barbosa, Marília I. F.; Bezerra, Daniel P.; Bomfim, Larissa M.; Moreira, Diogo R. M.; Soares, Milena B. P.; Ellena, Javier; Batista, Alzir A. |
Journal of publication | New Journal of Chemistry |
Year of publication | 2018 |
Journal volume | 42 |
Journal issue | 9 |
Pages of publication | 6794 |
a | 18.3197 ± 0.0007 Å |
b | 12.5109 ± 0.0007 Å |
c | 19.7938 ± 0.0016 Å |
α | 90° |
β | 116.165 ± 0.003° |
γ | 90° |
Cell volume | 4071.8 ± 0.4 Å3 |
Cell temperature | 293 ± 2 K |
Ambient diffraction temperature | 293 ± 2 K |
Number of distinct elements | 6 |
Space group number | 14 |
Hermann-Mauguin space group symbol | P 1 21/c 1 |
Hall space group symbol | -P 2ybc |
Residual factor for all reflections | 0.089 |
Residual factor for significantly intense reflections | 0.059 |
Weighted residual factors for significantly intense reflections | 0.141 |
Weighted residual factors for all reflections included in the refinement | 0.1555 |
Goodness-of-fit parameter for all reflections included in the refinement | 1.056 |
Diffraction radiation probe | x-ray |
Diffraction radiation wavelength | 0.71073 Å |
Diffraction radiation type | MoKα |