Information card for entry 7057202
Formula | C26 H58 Cl Li3 N6 Ni2 O26 P2 |
Calculated formula | C26 H54 Cl Li3 N6 Ni2 O26 P2 |
Title of publication | Complexes of phosphonate and phosphinate derivatives of dipicolylamine |
Authors of publication | Hlinová, Veronika; Jaroš, Adam; David, Tomáš; Císařová, Ivana; Kotek, Jan; Kubíček, Vojtěch; Hermann, Petr |
Journal of publication | New Journal of Chemistry |
Year of publication | 2018 |
Journal volume | 42 |
Journal issue | 10 |
Pages of publication | 7713 |
a | 9.3666 ± 0.0004 Å |
b | 35.0692 ± 0.0015 Å |
c | 14.1635 ± 0.0005 Å |
α | 90° |
β | 101.461 ± 0.002° |
γ | 90° |
Cell volume | 4559.6 ± 0.3 Å3 |
Cell temperature | 150 ± 2 K |
Ambient diffraction temperature | 150 ± 2 K |
Number of distinct elements | 8 |
Space group number | 14 |
Hermann-Mauguin space group symbol | P 1 21/c 1 |
Hall space group symbol | -P 2ybc |
Residual factor for all reflections | 0.042 |
Residual factor for significantly intense reflections | 0.0372 |
Weighted residual factors for significantly intense reflections | 0.09 |
Weighted residual factors for all reflections included in the refinement | 0.0931 |
Goodness-of-fit parameter for all reflections included in the refinement | 1.035 |
Diffraction radiation wavelength | 0.71073 Å |
Diffraction radiation type | MoKα |